Target
Aldo-keto reductase family 1 member C4
Ligand
BDBM50385687
Substrate
Meas. Tech.
ChEMBL_823521 (CHEMBL2045964)
IC50
5500±n/a nM
Citation
 Adeniji, AOTwenter, BMByrns, MCJin, YChen, MWinkler, JDPenning, TM Development of potent and selective inhibitors of aldo-keto reductase 1C3 (type 5 17ß-hydroxysteroid dehydrogenase) based on N-phenyl-aminobenzoates and their structure-activity relationships. J Med Chem 55:2311-23 (2012)  
Target
Name:
Aldo-keto reductase family 1 member C4
Synonyms:
3-alpha-HSD1 3-alpha-hydroxysteroid dehydrogenase type I AKR1C4 Aldo-keto reductase family 1 member C4 (AK1C4) CHDR DD-4 Dihydrodiol dehydrogenase 4 | HAKRA
Type:
Enzyme
Mol. Mass.:
37068.40
Organism:
Homo sapiens (Human)
Description:
P17516
Residue:
323
  
Inhibitor
Name:
BDBM50385687
Synonyms:
CHEMBL2041555
Type:
Small organic molecule
Emp. Form.:
C14H9F3N2O4
Mol. Mass.:
326.2275
SMILES:
OC(=O)c1cccc(Nc2ccc(cc2[N+]([O-])=O)C(F)(F)F)c1
: