Target
Cathepsin D
Ligand
BDBM50386533
Substrate
Meas. Tech.
ChEMBL_826121 (CHEMBL2049562)
IC50
1220±n/a nM
Citation
 Rueeger, HLueoend, RRogel, ORondeau, JMMöbitz, HMachauer, RJacobson, LStaufenbiel, MDesrayaud, SNeumann, U Discovery of cyclic sulfone hydroxyethylamines as potent and selectiveß-site APP-cleaving enzyme 1 (BACE1) inhibitors: structure-based design and in vivo reduction of amyloidß-peptides. J Med Chem 55:3364-86 (2012)  
Target
Name:
Cathepsin D
Synonyms:
CATD_HUMAN CTSD Cathepsin D heavy chain Cathepsin D precursor
Type:
Enzyme
Mol. Mass.:
44551.72
Organism:
Homo sapiens (Human)
Description:
Human proCathepsin D (SwissProt accession number P07339) was expressed in Sf9 cells, purified, and autoactivated.
Residue:
412
  
Inhibitor
Name:
BDBM50386533
Synonyms:
CHEMBL2047898
Type:
Small organic molecule
Emp. Form.:
C27H34F2N2O3S
Mol. Mass.:
504.632
SMILES:
CC(C)(C)c1cccc(CN[C@H]2CS(=O)(=O)C[C@@H](Cc3ccc4[nH]cc(CC(F)F)c4c3)[C@@H]2O)c1
: