Target
Carbonic anhydrase 2
Ligand
BDBM10890
Substrate
Meas. Tech.
ChEMBL_826238 (CHEMBL2049249)
Ki
15±n/a nM
Citation
 Hewitson, KSVullo, DScozzafava, AMastrolorenzo, ASupuran, CT Molecular cloning, characterization, and inhibition studies of aß-carbonic anhydrase from Malassezia globosa, a potential antidandruff target. J Med Chem 55:3513-20 (2012)  
Target
Name:
Carbonic anhydrase 2
Synonyms:
CA-II CAC Carbonate dehydratase II Carbonic anhydrase 2 (CA-II) Carbonic anhydrase C Carbonic anhydrase II (CA-II) Carbonic anhydrase II (hCA II) | Carbonic anhydrase isoenzyme II (hCA II)
Type:
Enzyme
Mol. Mass.:
29250.71
Organism:
Homo sapiens (Human)
Description:
P00918
Residue:
260
  
Inhibitor
Name:
BDBM10890
Synonyms:
1-N-(3-chloro-1H-indol-7-yl)benzene-1,4-disulfonamide Compound 6 Indisulam (IND) | Sulfonamide, 7
Type:
Small organic molecule
Emp. Form.:
C14H12ClN3O4S2
Mol. Mass.:
385.846
SMILES:
NS(=O)(=O)c1ccc(cc1)S(=O)(=O)Nc1cccc2c(Cl)c[nH]c12
: