Target
Carbonic anhydrase 2
Ligand
BDBM10873
Substrate
Meas. Tech.
ChEMBL_826238 (CHEMBL2049249)
Ki
33±n/a nM
Citation
 Hewitson, KSVullo, DScozzafava, AMastrolorenzo, ASupuran, CT Molecular cloning, characterization, and inhibition studies of aß-carbonic anhydrase from Malassezia globosa, a potential antidandruff target. J Med Chem 55:3513-20 (2012)  
Target
Name:
Carbonic anhydrase 2
Synonyms:
CA-II CAC Carbonate dehydratase II Carbonic anhydrase 2 (CA-II) Carbonic anhydrase C Carbonic anhydrase II (CA-II) Carbonic anhydrase II (hCA II) | Carbonic anhydrase isoenzyme II (hCA II)
Type:
Enzyme
Mol. Mass.:
29250.71
Organism:
Homo sapiens (Human)
Description:
P00918
Residue:
260
  
Inhibitor
Name:
BDBM10873
Synonyms:
4-[(2-aminopyrimidin-4-yl)amino]benzene-1-sulfonamide US9616064, Compound 1aa | aromatic/heteroaromatic sulfonamide 18
Type:
Small organic molecule
Emp. Form.:
C10H11N5O2S
Mol. Mass.:
265.292
SMILES:
Nc1nccc(Nc2ccc(cc2)S(N)(=O)=O)n1
: