Target
Growth hormone secretagogue receptor type 1
Ligand
BDBM50386956
Substrate
Meas. Tech.
ChEMBL_827492 (CHEMBL2051349)
Ki
206±n/a nM
Citation
 Kung, DWCoffey, SBJones, RMCabral, SJiao, WFichtner, MCarpino, PARose, CRHank, RFLopaze, MGSwartz, RChen, HTHendsch, ZPosner, BWielis, CFManning, BDubins, JStock, IAVarma, SCampbell, MDeBartola, DKosa-Maines, RSteyn, SJMcClure, KF Identification of spirocyclic piperidine-azetidine inverse agonists of the ghrelin receptor. Bioorg Med Chem Lett 22:4281-7 (2012)  
Target
Name:
Growth hormone secretagogue receptor type 1
Synonyms:
GH-releasing peptide receptor GHS-R GHSR_HUMAN Ghrelin receptor | Ghrelin receptor 1a (GHS-R1a)
Type:
Receptor
Mol. Mass.:
41334.57
Organism:
Homo sapiens (Human)
Description:
Receptor binding studies use plasma membranes from LLC PK-1 cells transiently transfected with hGHSR1a.
Residue:
366
  
Inhibitor
Name:
BDBM50386956
Synonyms:
CHEMBL2048821
Type:
Small organic molecule
Emp. Form.:
C25H28N6OS
Mol. Mass.:
460.594
SMILES:
Cc1cn2cc(CC(=O)N3CCC4(CN(Cc5ccc(cc5)-n5cccn5)C4)CC3)nc2s1
: