Target
Serine/threonine-protein kinase pim-2
Ligand
BDBM50387295
Substrate
Meas. Tech.
ChEMBL_828046 (CHEMBL2049740)
IC50
5±n/a nM
Citation
 Dakin, LABlock, MHChen, HCode, EDowling, JEFeng, XFerguson, ADGreen, IHird, AWHoward, TKeeton, EKLamb, MLLyne, PDPollard, HRead, JWu, AJZhang, TZheng, X Discovery of novel benzylidene-1,3-thiazolidine-2,4-diones as potent and selective inhibitors of the PIM-1, PIM-2, and PIM-3 protein kinases. Bioorg Med Chem Lett 22:4599-604 (2012)  
Target
Name:
Serine/threonine-protein kinase pim-2
Synonyms:
PIM2 Pim-2h Serine/threonine-protein kinase PIM | Serine/threonine-protein kinase pim-2 (PIM2)
Type:
Serine/threonine-protein kinase
Mol. Mass.:
34185.93
Organism:
Homo sapiens (Human)
Description:
Q9P1W9
Residue:
311
  
Inhibitor
Name:
BDBM50387295
Synonyms:
CHEMBL2048868
Type:
Small organic molecule
Emp. Form.:
C16H19N3O3S
Mol. Mass.:
333.405
SMILES:
COc1cccc(C=C2SC(O)=NC2=O)c1N1CCC[C@@H](N)C1
: