Target
Norepinephrine transporter
Ligand
BDBM50136674
Substrate
Ki
15.9±n/a nM
Comments
PDSP_2398
Citation
 Wong, DTBymaster, FPMayle, DAReid, LRKrushinski, JHRobertson, DW LY248686, a new inhibitor of serotonin and norepinephrine uptake. Neuropsychopharmacology 8:23-33 (1993)  
Target
Name:
Norepinephrine transporter
Synonyms:
Type:
Enzyme Catalytic Domain
Mol. Mass.:
2082.45
Organism:
RAT
Description:
Norepinephrine transporter 0 RAT::Q9JIA2
Residue:
19
MLLARMKPQVQPELGGADQ
  
Inhibitor
Name:
BDBM50136674
Synonyms:
(3R)-N-methyl-3-(1-naphthyloxy)-3-(2-thienyl)propan-1-amine (R)-duloxetine LY248685
Type:
Small organic molecule
Emp. Form.:
C18H19NOS
Mol. Mass.:
297.415
SMILES:
CNCC[C@@H](Oc1cccc2ccccc12)c1cccs1
: