Target
Endothelin-1 receptor
Ligand
BDBM50117910
Substrate
Meas. Tech.
ChEMBL_828629 (CHEMBL2060186)
Ki
1.9±n/a nM
Citation
 Bai, RWei, ZLiu, JXie, WYao, HWu, XJiang, JWang, QXu, J Synthesis and biological evaluation of 4'-[(benzimidazole-1-yl)methyl]biphenyl-2-sulfonamide derivatives as dual angiotensin II/endothelin A receptor antagonists. Bioorg Med Chem 20:4661-7 (2012)  
Target
Name:
Endothelin-1 receptor
Synonyms:
EDNRA ET-A ETA-R Endothelin receptor type A hET-AR
Type:
Enzyme Catalytic Domain
Mol. Mass.:
48736.88
Organism:
Homo sapiens (Human)
Description:
P25101
Residue:
427
  
Inhibitor
Name:
BDBM50117910
Synonyms:
4''-(2-Butyl-4-oxo-1,3-diaza-spiro[4.4]non-1-en-3-ylmethyl)-2''-(3,3-dimethyl-2-oxo-pyrrolidin-1-ylmethyl)-biphenyl-2-sulfonic acid (3,4-dimethyl-isoxazol-5-yl)-amide BMS-248360 | CHEMBL11706
Type:
Small organic molecule
Emp. Form.:
C36H45N5O5S
Mol. Mass.:
659.838
SMILES:
CCCCC1=NC2(CCCC2)C(=O)N1Cc1ccc(c(CN2CCC(C)(C)C2=O)c1)-c1ccccc1S(=O)(=O)Nc1onc(C)c1C
: