Target
Glucose-dependent insulinotropic receptor
Ligand
BDBM50387897
Substrate
Meas. Tech.
ChEMBL_830702 (CHEMBL2061689)
EC50
268±n/a nM
Citation
 Sakairi, MKogami, MTorii, MKataoka, HFujieda, HMakino, MKataoka, DOkamoto, RMiyazawa, TOkabe, MInoue, MTakahashi, NHarada, SWatanabe, N Synthesis and SAR studies of bicyclic amine series GPR119 agonists. Bioorg Med Chem Lett 22:5123-8 (2012)  
Target
Name:
Glucose-dependent insulinotropic receptor
Synonyms:
G-protein coupled receptor 119 (GPR119) GPR119 | Glucose-dependent insulinotropic receptor
Type:
Protein
Mol. Mass.:
36901.49
Organism:
Homo sapiens (Human)
Description:
Q8TDV5
Residue:
335
  
Inhibitor
Name:
BDBM50387897
Synonyms:
CHEMBL2058397
Type:
Small organic molecule
Emp. Form.:
C19H30N4O4S
Mol. Mass.:
410.531
SMILES:
CC(C)(C)OC(=O)N1CCC(CCCNc2ccc3c(NNS3(=O)=O)c2)CC1
: