Target
Glucose-dependent insulinotropic receptor
Ligand
BDBM50387907
Substrate
Meas. Tech.
ChEMBL_830706 (CHEMBL2061693)
EC50
139±n/a nM
Citation
 Sakairi, MKogami, MTorii, MKataoka, HFujieda, HMakino, MKataoka, DOkamoto, RMiyazawa, TOkabe, MInoue, MTakahashi, NHarada, SWatanabe, N Synthesis and SAR studies of bicyclic amine series GPR119 agonists. Bioorg Med Chem Lett 22:5123-8 (2012)  
Target
Name:
Glucose-dependent insulinotropic receptor
Synonyms:
GP119_MOUSE | Gpr119
Type:
PROTEIN
Mol. Mass.:
37009.07
Organism:
Mus musculus
Description:
ChEMBL_1506420
Residue:
335
  
Inhibitor
Name:
BDBM50387907
Synonyms:
CHEMBL2058668
Type:
Small organic molecule
Emp. Form.:
C22H26N4O4
Mol. Mass.:
410.4662
SMILES:
COC(=O)c1cnc(nc1)N1CCC(CCCNc2ccc3c(O)coc3c2)CC1
: