Target
Poly [ADP-ribose] polymerase 1
Ligand
BDBM50387941
Substrate
Meas. Tech.
ChEMBL_830731 (CHEMBL2061718)
Ki
0.7±n/a nM
Citation
 Zhu, GDGong, JGandhi, VBLiu, XShi, YJohnson, EFDonawho, CKEllis, PABouska, JJOsterling, DJOlson, AMPark, CLuo, YShoemaker, AGiranda, VLPenning, TD Discovery and SAR of orally efficacious tetrahydropyridopyridazinone PARP inhibitors for the treatment of cancer. Bioorg Med Chem 20:4635-45 (2012)  
Target
Name:
Poly [ADP-ribose] polymerase 1
Synonyms:
(ARTD1 or PARP1) 2.4.2.30 ADPRT ARTD1 Human diphtheria toxin-like ADP-ribosyltransferase (ARTD1 or PARP1) NT-PARP-1 PARP1 PPOL Poly [ADP-ribose] polymerase 1 (PARP) Poly [ADP-ribose] polymerase 1 (PARP1) Poly [ADP-ribose] polymerase 1, 28-kDa form Poly [ADP-ribose] polymerase 1, processed C-terminus Poly [ADP-ribose] polymerase-1 Poly(ADP-ribose) polymerase-1 (ARTD1/PARP1) Protein poly-ADP-ribosyltransferase PARP1 | Synonyms=ADPRT
Type:
Mol. Mass.:
113114.22
Organism:
Homo sapiens (Human)
Description:
P09874
Residue:
1014
  
Inhibitor
Name:
BDBM50387941
Synonyms:
CHEMBL2058922 | US9283222, 556
Type:
Small organic molecule
Emp. Form.:
C20H24FN5O4S
Mol. Mass.:
449.499
SMILES:
CS(=O)(=O)N1CCN(CC1)C(=O)c1cc(Cc2n[nH]c(=O)c3CCCNc23)ccc1F
: