Target
5-hydroxytryptamine receptor 4
Ligand
BDBM10755
Substrate
Meas. Tech.
ChEMBL_829446 (CHEMBL2061925)
EC50
10±n/a nM
Citation
 Long, DDArmstrong, SRBeattie, DTChoi, SKFatheree, PRGendron, RAGoldblum, AAHumphrey, PPMarquess, DGShaw, JPSmith, JADerek Turner, SVickery, RG Discovery, oral pharmacokinetics and in vivo efficacy of a highly selective 5-HT4 receptor agonist: clinical compound TD-2749. Bioorg Med Chem Lett 22:4849-53 (2012)  
Target
Name:
5-hydroxytryptamine receptor 4
Synonyms:
5-HT4 5HT4R_CAVPO Serotonin 4 (5-HT4) receptor
Type:
Enzyme Catalytic Domain
Mol. Mass.:
43735.29
Organism:
GUINEA PIG
Description:
5-HT4 HTR4 GUINEA PIG::O70528
Residue:
388
  
Inhibitor
Name:
BDBM10755
Synonyms:
14C-5-hydroxy tryptamine creatinine disulfate 5-HT 5-hydroxy tryptamine creatinine disulfate Serotonin | [3H]-5-HT
Type:
Small organic molecule
Emp. Form.:
C10H12N2O
Mol. Mass.:
176.2151
SMILES:
NCCc1c[nH]c2ccc(O)cc12
: