Target
Bile acid receptor
Ligand
BDBM21674
Substrate
Meas. Tech.
ChEMBL_830883 (CHEMBL2065432)
EC50
13000±n/a nM
Citation
 Pellicciari, RGioiello, ASabbatini, PVenturoni, FNuti, RColliva, CRizzo, GAdorini, LPruzanski, MRoda, AMacchiarulo, A Avicholic Acid: A Lead Compound from Birds on the Route to Potent TGR5 Modulators. ACS Med Chem Lett 3:273-277 (2012)  
Target
Name:
Bile acid receptor
Synonyms:
BAR FXR HRR1 NR1H4_HUMAN RIP14 Retinoid X receptor-interacting protein 14 | farnesoid x receptor
Type:
Nuclear Receptor
Mol. Mass.:
55916.24
Organism:
Homo sapiens (Human)
Description:
Q96RI1
Residue:
486
  
Inhibitor
Name:
BDBM21674
Synonyms:
(4R)-4-[(1S,2S,5R,7S,9R,10R,11S,14R,15R)-5,9-dihydroxy-2,15-dimethyltetracyclo[8.7.0.0^{2,7}.0^{11,15}]heptadecan-14-yl]pentanoic acid CHENODIOL US10208081, CDCA
Type:
Steroid
Emp. Form.:
C24H40O4
Mol. Mass.:
392.572
SMILES:
[H][C@@]1(CC[C@@]2([H])[C@]3([H])[C@H](O)C[C@]4([H])C[C@H](O)CC[C@]4(C)[C@@]3([H])CC[C@]12C)[C@H](C)CCC(O)=O
: