Target
Cannabinoid receptor 1
Ligand
BDBM50388893
Substrate
Meas. Tech.
ChEMBL_830979 (CHEMBL2065579)
Ki
0.08±n/a nM
Citation
 Dow, RLCarpino, PAGautreau, DHadcock, JRIredale, PAKelly-Sullivan, DLizano, JSSchneider, SRScott, DOWard, KM Design of a Potent CB1 Receptor Antagonist Series: Potential Scaffold for Peripherally-Targeted Agents. ACS Med Chem Lett 3:397-401 (2012)  
Target
Name:
Cannabinoid receptor 1
Synonyms:
CANN6 CB-R CNR CNR1_HUMAN Cannabinoid receptor Cannabinoid receptor 1 (brain)
Type:
G Protein-Coupled Receptor (GPCR)
Mol. Mass.:
52868.96
Organism:
Homo sapiens (Human)
Description:
P21554
Residue:
472
  
Inhibitor
Name:
BDBM50388893
Synonyms:
CHEMBL2063246
Type:
Small organic molecule
Emp. Form.:
C24H20Cl2N4O2
Mol. Mass.:
467.347
SMILES:
Clc1ccc(cc1)-c1c2OCCCC(NC(=O)C3(CC3)C#N)c2nn1-c1ccccc1Cl
: