Target
Adenosine receptor A3
Ligand
BDBM50389139
Substrate
Meas. Tech.
ChEMBL_833205 (CHEMBL2067496)
Ki
1.7±n/a nM
Citation
 Tosh, DKDeflorian, FPhan, KGao, ZGWan, TCGizewski, EAuchampach, JAJacobson, KA Structure-guided design of A(3) adenosine receptor-selective nucleosides: combination of 2-arylethynyl and bicyclo[3.1.0]hexane substitutions. J Med Chem 55:4847-60 (2012)  
Target
Name:
Adenosine receptor A3
Synonyms:
A3 adenosine receptor (hA3) ADORA3 | Adenosine A3 receptor (A3AR)
Type:
G Protein-Coupled Receptor (GPCR)
Mol. Mass.:
36197.32
Organism:
Homo sapiens (Human)
Description:
P0DMS8
Residue:
318
  
Inhibitor
Name:
BDBM50389139
Synonyms:
CHEMBL2064646
Type:
Small organic molecule
Emp. Form.:
C22H20F2N6O3
Mol. Mass.:
454.4294
SMILES:
CNC(=O)[C@@]12C[C@@H]1[C@H]([C@H](O)[C@@H]2O)n1cnc2c(NC)nc(nc12)C#Cc1cc(F)cc(F)c1
: