Target
Adenosine receptor A3
Ligand
BDBM50389148
Substrate
Meas. Tech.
ChEMBL_833211 (CHEMBL2067575)
Ki
3.1±n/a nM
Citation
 Tosh, DKDeflorian, FPhan, KGao, ZGWan, TCGizewski, EAuchampach, JAJacobson, KA Structure-guided design of A(3) adenosine receptor-selective nucleosides: combination of 2-arylethynyl and bicyclo[3.1.0]hexane substitutions. J Med Chem 55:4847-60 (2012)  
Target
Name:
Adenosine receptor A3
Synonyms:
A3AR Adenosine A3 receptor Gpcr2
Type:
PROTEIN
Mol. Mass.:
36460.91
Organism:
Mus musculus
Description:
ChEMBL_1515686
Residue:
319
  
Inhibitor
Name:
BDBM50389148
Synonyms:
CHEMBL2064657
Type:
Small organic molecule
Emp. Form.:
C28H23ClF2N6O3
Mol. Mass.:
564.97
SMILES:
CNC(=O)[C@@]12C[C@@H]1[C@H]([C@H](O)[C@@H]2O)n1cnc2c(NCc3cccc(Cl)c3)nc(nc12)C#Cc1ccc(F)c(F)c1
: