Target
Adenosine receptor A3
Ligand
BDBM50389129
Substrate
Meas. Tech.
ChEMBL_833211 (CHEMBL2067575)
Ki
48±n/a nM
Citation
 Tosh, DKDeflorian, FPhan, KGao, ZGWan, TCGizewski, EAuchampach, JAJacobson, KA Structure-guided design of A(3) adenosine receptor-selective nucleosides: combination of 2-arylethynyl and bicyclo[3.1.0]hexane substitutions. J Med Chem 55:4847-60 (2012)  
Target
Name:
Adenosine receptor A3
Synonyms:
A3AR Adenosine A3 receptor Gpcr2
Type:
PROTEIN
Mol. Mass.:
36460.91
Organism:
Mus musculus
Description:
ChEMBL_1515686
Residue:
319
  
Inhibitor
Name:
BDBM50389129
Synonyms:
CHEMBL2064661
Type:
Small organic molecule
Emp. Form.:
C38H29ClN6O3
Mol. Mass.:
653.128
SMILES:
CNC(=O)[C@@]12C[C@@H]1[C@H]([C@H](O)[C@@H]2O)n1cnc2c(NCc3cccc(Cl)c3)nc(nc12)C#Cc1ccc2ccc3cccc4ccc1c2c34
: