Target
Casein kinase I isoform delta
Ligand
BDBM50389320
Substrate
Meas. Tech.
ChEMBL_831780 (CHEMBL2065143)
IC50
<10000±n/a nM
Citation
 Maryanoff, BEO'Neill, JCMcComsey, DFYabut, SCLuci, DKGibbs, ACConnelly, MA Pyrimidinopyrimidine inhibitors of ketohexokinase: exploring the ring C2 group that interacts with Asp-27B in the ligand binding pocket. Bioorg Med Chem Lett 22:5326-9 (2012)  
Target
Name:
Casein kinase I isoform delta
Synonyms:
CKI-delta CSNK1D Casein kinase I delta Casein kinase I isoform delta (CK1D) KC1D_HUMAN | casein kinases 1 delta (CK1 delta)
Type:
Enzyme
Mol. Mass.:
47356.76
Organism:
Homo sapiens (Human)
Description:
P48730
Residue:
415
  
Inhibitor
Name:
BDBM50389320
Synonyms:
CHEMBL2063926
Type:
Small organic molecule
Emp. Form.:
C26H35N9S
Mol. Mass.:
505.681
SMILES:
CSc1ccccc1Nc1nc(nc2c(NCC3CC3)ncnc12)N1CCN(CC1)C1CCNCC1
: