Target
Aurora kinase A
Ligand
BDBM50389320
Substrate
Meas. Tech.
ChEMBL_831775 (CHEMBL2065138)
IC50
<10000±n/a nM
Citation
 Maryanoff, BEO'Neill, JCMcComsey, DFYabut, SCLuci, DKGibbs, ACConnelly, MA Pyrimidinopyrimidine inhibitors of ketohexokinase: exploring the ring C2 group that interacts with Asp-27B in the ligand binding pocket. Bioorg Med Chem Lett 22:5326-9 (2012)  
Target
Name:
Aurora kinase A
Synonyms:
AIK ARK1 AURKA AYK1 Aurora kinase A (AURA) Aurora kinase A (Aurora A) Aurora-related kinase 1 BTAK Breast-tumor-amplified kinase STK15 Serine/threonine kinase 15 Serine/threonine-protein kinase aurora A hARK1
Type:
Serine/threonine-protein kinase
Mol. Mass.:
45830.98
Organism:
Homo sapiens (Human)
Description:
O14965
Residue:
403
  
Inhibitor
Name:
BDBM50389320
Synonyms:
CHEMBL2063926
Type:
Small organic molecule
Emp. Form.:
C26H35N9S
Mol. Mass.:
505.681
SMILES:
CSc1ccccc1Nc1nc(nc2c(NCC3CC3)ncnc12)N1CCN(CC1)C1CCNCC1
: