Target
Dipeptidyl peptidase 8
Ligand
BDBM50389472
Substrate
Meas. Tech.
ChEMBL_832306 (CHEMBL2066844)
IC50
43±n/a nM
Citation
 Wu, WLiu, YMilo, LJShu, YZhao, PLi, YWoznica, IYu, GSanford, DGZhou, YPoplawski, SEConnolly, BASudmeier, JLBachovchin, WWLai, JH 4-Substituted boro-proline dipeptides: synthesis, characterization, and dipeptidyl peptidase IV, 8, and 9 activities. Bioorg Med Chem Lett 22:5536-40 (2012)  
Target
Name:
Dipeptidyl peptidase 8
Synonyms:
DPP8 DPRP-1 Dipeptidyl peptidase 8 (DPP-8) Dipeptidyl peptidase 8/9 Dipeptidyl peptidase VIII Prolyl dipeptidase DPP8
Type:
Enzyme
Mol. Mass.:
103342.62
Organism:
Homo sapiens (Human)
Description:
Q6V1X1
Residue:
898
  
Inhibitor
Name:
BDBM50389472
Synonyms:
CHEMBL2063032
Type:
Small organic molecule
Emp. Form.:
C10H21BN2O4
Mol. Mass.:
244.096
SMILES:
CC(C)(C)[C@H](N)C(=O)N1C[C@H](O)C[C@H]1B(O)O
: