Target
Acetylcholinesterase
Ligand
BDBM50389619
Substrate
Meas. Tech.
ChEMBL_834152 (CHEMBL2072892)
IC50
26.4±n/a nM
Citation
 Anand, PSingh, B Synthesis and evaluation of novel 4-[(3H,3aH,6aH)-3-phenyl)-4,6-dioxo-2-phenyldihydro-2H-pyrrolo[3,4-d]isoxazol-5(3H,6H,6aH)-yl]benzoic acid derivatives as potent acetylcholinesterase inhibitors and anti-amnestic agents. Bioorg Med Chem 20:521-30 (2011)  
Target
Name:
Acetylcholinesterase
Synonyms:
ACES_RAT Acetylcholinesterase and butyrylcholinesterase (AChE and BChE) Acetylcholinesterase, AChE | Ache
Type:
Enzyme
Mol. Mass.:
68193.62
Organism:
Rattus norvegicus (rat)
Description:
P37136
Residue:
614
  
Inhibitor
Name:
BDBM50389619
Synonyms:
CHEMBL2069764 | CHEMBL2069786
Type:
Small organic molecule
Emp. Form.:
C24H17N3O7
Mol. Mass.:
459.4077
SMILES:
OC(=O)c1ccc(cc1)-n1c(O)c2ON([C@H](c2c1O)c1ccc(cc1)[N+]([O-])=O)c1ccccc1
: