Target
Melanocortin receptor 5
Ligand
BDBM50389775
Substrate
Meas. Tech.
ChEMBL_834299 (CHEMBL2073119)
Ki
3±n/a nM
Citation
 Conde-Frieboes, KThøgersen, HLau, JFSensfuss, UHansen, TKChristensen, LSpetzler, JOlsen, HBNilsson, CRaun, KDahl, KHansen, BSWulff, BS Identification and in vivo and in vitro characterization of long acting and melanocortin 4 receptor (MC4-R) selectivea-melanocyte-stimulating hormone (a-MSH) analogues. J Med Chem 55:1969-77 (2012)  
Target
Name:
Melanocortin receptor 5
Synonyms:
MC-2 MC5R Melanocortin MC5 Melanocortin receptor 5 | Melanocortin receptor 5 (MC5R)
Type:
Enzyme
Mol. Mass.:
36612.92
Organism:
Homo sapiens (Human)
Description:
P33032
Residue:
325
  
Inhibitor
Name:
BDBM50389775
Synonyms:
CHEMBL2070248
Type:
Small organic molecule
Emp. Form.:
C74H114N18O15
Mol. Mass.:
1495.8086
SMILES:
CCCCCCCCCCCCCCCC(=O)NCC(=O)NCC(=O)NCC(=O)NCC(=O)NCC(=O)N[C@@H](CCCC)C(=O)N[C@H]1CCC(=O)NCCCC[C@H](NC(=O)[C@H](Cc2c[nH]c3ccccc23)NC(=O)[C@H](CCCN=C(N)N)NC(=O)[C@@H](Cc2ccccc2)NC(=O)[C@@H]2C[C@@H](O)CN2C1=O)C(N)=O
: