Target
Adenosine receptor A2a
Ligand
BDBM50389796
Substrate
Meas. Tech.
ChEMBL_834567 (CHEMBL2072275)
Ki
210±n/a nM
Citation
 Tosh, DKPhan, KGao, ZGGakh, AAXu, FDeflorian, FAbagyan, RStevens, RCJacobson, KAKatritch, V Optimization of adenosine 5'-carboxamide derivatives as adenosine receptor agonists using structure-based ligand design and fragment screening. J Med Chem 55:4297-308 (2012)  
Target
Name:
Adenosine receptor A2a
Synonyms:
A2A adenosine receptor (hA2A) ADENOSINE A2 ADORA2 Adenosine A2A receptor (A2AAR)
Type:
G Protein-Coupled Receptor (GPCR)
Mol. Mass.:
44716.46
Organism:
Homo sapiens (Human)
Description:
P29274
Residue:
412
  
Inhibitor
Name:
BDBM50389796
Synonyms:
CHEMBL1235128
Type:
Small organic molecule
Emp. Form.:
C13H18N6O4
Mol. Mass.:
322.3198
SMILES:
CCCNC(=O)[C@H]1O[C@H]([C@H](O)[C@@H]1O)n1cnc2c(N)ncnc12
: