Target
Adenosine receptor A1
Ligand
BDBM50389796
Substrate
Meas. Tech.
ChEMBL_834569 (CHEMBL2072277)
Ki
1240±n/a nM
Citation
 Tosh, DKPhan, KGao, ZGGakh, AAXu, FDeflorian, FAbagyan, RStevens, RCJacobson, KAKatritch, V Optimization of adenosine 5'-carboxamide derivatives as adenosine receptor agonists using structure-based ligand design and fragment screening. J Med Chem 55:4297-308 (2012)  
Target
Name:
Adenosine receptor A1
Synonyms:
AA1R_RAT ADENOSINE A1 high Adenosine A1 receptor (A1) Adenosine receptors A1 | Adora1
Type:
Protein
Mol. Mass.:
36704.13
Organism:
Rattus norvegicus (rat)
Description:
Residue:
326
  
Inhibitor
Name:
BDBM50389796
Synonyms:
CHEMBL1235128
Type:
Small organic molecule
Emp. Form.:
C13H18N6O4
Mol. Mass.:
322.3198
SMILES:
CCCNC(=O)[C@H]1O[C@H]([C@H](O)[C@@H]1O)n1cnc2c(N)ncnc12
: