Target
Adenosine receptor A3
Ligand
BDBM50389898
Substrate
Meas. Tech.
ChEMBL_834863 (CHEMBL2073180)
Ki
253±n/a nM
Citation
 Baraldi, PGSaponaro, GRomagnoli, RAghazadeh Tabrizi, MBaraldi, SMoorman, ARCosconati, SDi Maro, SMarinelli, LGessi, SMerighi, SVarani, KBorea, PAPreti, D Water-soluble pyrazolo[4,3-e][1,2,4]triazolo[1,5-c]pyrimidines as human A3 adenosine receptor antagonists. J Med Chem 55:5380-90 (2012)  
Target
Name:
Adenosine receptor A3
Synonyms:
A3 adenosine receptor (hA3) ADORA3 | Adenosine A3 receptor (A3AR)
Type:
G Protein-Coupled Receptor (GPCR)
Mol. Mass.:
36197.32
Organism:
Homo sapiens (Human)
Description:
P0DMS8
Residue:
318
  
Inhibitor
Name:
BDBM50389898
Synonyms:
CHEMBL2070881
Type:
Small organic molecule
Emp. Form.:
C18H21N9O2
Mol. Mass.:
395.4184
SMILES:
CN1CCC(CC1)NC(=O)Nc1nc2nn(C)cc2c2nc(nn12)-c1ccco1
: