Target
Adenosine receptor A1
Ligand
BDBM50389893
Substrate
Meas. Tech.
ChEMBL_834861 (CHEMBL2073178)
Ki
614±n/a nM
Citation
 Baraldi, PGSaponaro, GRomagnoli, RAghazadeh Tabrizi, MBaraldi, SMoorman, ARCosconati, SDi Maro, SMarinelli, LGessi, SMerighi, SVarani, KBorea, PAPreti, D Water-soluble pyrazolo[4,3-e][1,2,4]triazolo[1,5-c]pyrimidines as human A3 adenosine receptor antagonists. J Med Chem 55:5380-90 (2012)  
Target
Name:
Adenosine receptor A1
Synonyms:
A1 adenosine receptor (hA1) AA1R_HUMAN ADORA1 Adenosine A1-receptor Adenosine receptor A1 (hA1) | Adenosine transporter (AdT)
Type:
G Protein-Coupled Receptor (GPCR)
Mol. Mass.:
36520.92
Organism:
Homo sapiens (Human)
Description:
P30542
Residue:
326
  
Inhibitor
Name:
BDBM50389893
Synonyms:
CHEMBL2071047
Type:
Small organic molecule
Emp. Form.:
C25H25ClN10O3
Mol. Mass.:
548.984
SMILES:
Cn1cc2c(n1)nc(NC(=O)NC1CCN(CC1)C(=O)NCc1ccc(Cl)cc1)n1nc(nc21)-c1ccco1
: