Target
High affinity cAMP-specific and IBMX-insensitive 3',5'-cyclic phosphodiesterase 8B
Ligand
BDBM50390368
Substrate
Meas. Tech.
ChEMBL_835072 (CHEMBL2073616)
IC50
388±n/a nM
Citation
 DeNinno, MPWright, SWEtienne, JBOlson, TVRocke, BNCorbett, JWKung, DWDiRico, KJAndrews, KMMillham, MLParker, JCEsler, Wvan Volkenburg, MBoyer, DDHouseknecht, KLDoran, SD Discovery of triazolopyrimidine-based PDE8B inhibitors: exceptionally ligand-efficient and lipophilic ligand-efficient compounds for the treatment of diabetes. Bioorg Med Chem Lett 22:5721-6 (2012)  
Target
Name:
High affinity cAMP-specific and IBMX-insensitive 3',5'-cyclic phosphodiesterase 8B
Synonyms:
PDE8B Phosphodiesterase 8 | Phosphodiesterase 8B
Type:
PROTEIN
Mol. Mass.:
98984.88
Organism:
Homo sapiens (Human)
Description:
ChEMBL_876321
Residue:
885
  
Inhibitor
Name:
BDBM50390368
Synonyms:
CHEMBL2070908
Type:
Small organic molecule
Emp. Form.:
C14H17N7O2
Mol. Mass.:
315.3305
SMILES:
Cc1cc(no1)-c1nc(N)c2nnn(CC3CCCCO3)c2n1
: