Target
Aldo-keto reductase family 1 member C4
Ligand
BDBM50390657
Substrate
Meas. Tech.
ChEMBL_835615 (CHEMBL2071726)
IC50
20100±n/a nM
Citation
 Sinreih, MSosic, IBeranic, NTurk, SAdeniji, AOPenning, TMRižner, TLGobec, S N-Benzoyl anthranilic acid derivatives as selective inhibitors of aldo-keto reductase AKR1C3. Bioorg Med Chem Lett 22:5948-51 (2012)  
Target
Name:
Aldo-keto reductase family 1 member C4
Synonyms:
3-alpha-HSD1 3-alpha-hydroxysteroid dehydrogenase type I AKR1C4 Aldo-keto reductase family 1 member C4 (AK1C4) CHDR DD-4 Dihydrodiol dehydrogenase 4 | HAKRA
Type:
Enzyme
Mol. Mass.:
37068.40
Organism:
Homo sapiens (Human)
Description:
P17516
Residue:
323
  
Inhibitor
Name:
BDBM50390657
Synonyms:
CHEMBL2070002
Type:
Small organic molecule
Emp. Form.:
C14H10ClNO4
Mol. Mass.:
291.686
SMILES:
OC(=O)c1cc(Cl)ccc1NC(=O)c1cccc(O)c1
: