Target
LIM domain kinase 1
Ligand
BDBM50390779
Substrate
Meas. Tech.
ChEMBL_835728 (CHEMBL2071839)
IC50
38±n/a nM
Citation
 He, LSeitz, SPTrainor, GLTortolani, DVaccaro, WPoss, MTarby, CMTokarski, JSPenhallow, BHung, CYAttar, RLin, TA Modulation of cofilin phosphorylation by inhibition of the Lim family kinases. Bioorg Med Chem Lett 22:5995-8 (2012)  
Target
Name:
LIM domain kinase 1
Synonyms:
LIMK LIMK1 | LIMK1_HUMAN
Type:
Enzyme Catalytic Domain
Mol. Mass.:
72591.81
Organism:
Homo sapiens (Human)
Description:
gi_4505001
Residue:
647
  
Inhibitor
Name:
BDBM50390779
Synonyms:
CHEMBL2070497
Type:
Small organic molecule
Emp. Form.:
C21H18Cl2N6OS
Mol. Mass.:
473.378
SMILES:
CCCNc1ncc(s1)-c1cc(nc(n1)-c1cnccn1)-c1c(Cl)cc(OC)cc1Cl
: