Target
LIM domain kinase 1
Ligand
BDBM50390792
Substrate
Meas. Tech.
ChEMBL_835728 (CHEMBL2071839)
IC50
87±n/a nM
Citation
 He, LSeitz, SPTrainor, GLTortolani, DVaccaro, WPoss, MTarby, CMTokarski, JSPenhallow, BHung, CYAttar, RLin, TA Modulation of cofilin phosphorylation by inhibition of the Lim family kinases. Bioorg Med Chem Lett 22:5995-8 (2012)  
Target
Name:
LIM domain kinase 1
Synonyms:
LIMK LIMK1 | LIMK1_HUMAN
Type:
Enzyme Catalytic Domain
Mol. Mass.:
72591.81
Organism:
Homo sapiens (Human)
Description:
gi_4505001
Residue:
647
  
Inhibitor
Name:
BDBM50390792
Synonyms:
CHEMBL2070616
Type:
Small organic molecule
Emp. Form.:
C22H20N6O2S
Mol. Mass.:
432.498
SMILES:
COc1cc(C)c(c(C)c1)-c1cc(nc(n1)-c1cnccn1)-c1cnc(NC(C)=O)s1
: