Target
LIM domain kinase 2
Ligand
BDBM50390790
Substrate
Meas. Tech.
ChEMBL_835730 (CHEMBL2071841)
IC50
16±n/a nM
Citation
 He, LSeitz, SPTrainor, GLTortolani, DVaccaro, WPoss, MTarby, CMTokarski, JSPenhallow, BHung, CYAttar, RLin, TA Modulation of cofilin phosphorylation by inhibition of the Lim family kinases. Bioorg Med Chem Lett 22:5995-8 (2012)  
Target
Name:
LIM domain kinase 2
Synonyms:
LIMK2 | LIMK2_HUMAN
Type:
PROTEIN
Mol. Mass.:
72238.81
Organism:
Homo sapiens (Human)
Description:
ChEMBL_1514398
Residue:
638
  
Inhibitor
Name:
BDBM50390790
Synonyms:
CHEMBL2070614
Type:
Small organic molecule
Emp. Form.:
C22H21N7O2S
Mol. Mass.:
447.513
SMILES:
CNC(=O)Nc1ncc(s1)-c1cc(nc(n1)-c1cnccn1)-c1c(C)cc(OC)cc1C
: