Target
Dual specificity testis-specific protein kinase 2
Ligand
BDBM50390789
Substrate
Meas. Tech.
ChEMBL_835732 (CHEMBL2071843)
IC50
415±n/a nM
Citation
 He, LSeitz, SPTrainor, GLTortolani, DVaccaro, WPoss, MTarby, CMTokarski, JSPenhallow, BHung, CYAttar, RLin, TA Modulation of cofilin phosphorylation by inhibition of the Lim family kinases. Bioorg Med Chem Lett 22:5995-8 (2012)  
Target
Name:
Dual specificity testis-specific protein kinase 2
Synonyms:
TESK2 Testicular protein kinase 2
Type:
PROTEIN
Mol. Mass.:
63642.30
Organism:
Homo sapiens (Human)
Description:
ChEMBL_835732
Residue:
571
  
Inhibitor
Name:
BDBM50390789
Synonyms:
CHEMBL2070613
Type:
Small organic molecule
Emp. Form.:
C26H29N7O2S
Mol. Mass.:
503.619
SMILES:
CCC(CC)Oc1cc(C)c(c(C)c1)-c1cc(nc(n1)-c1cnccn1)-c1cnc(NC(=O)NC)s1
: