Target
ATP-dependent translocase ABCB1
Ligand
BDBM50017712
Substrate
Meas. Tech.
ChEMBL_838282 (CHEMBL2076230)
Ki
12200±n/a nM
Citation
 Ekins, SKim, RBLeake, BFDantzig, AHSchuetz, EGLan, LBYasuda, KShepard, RLWinter, MASchuetz, JDWikel, JHWrighton, SA Three-dimensional quantitative structure-activity relationships of inhibitors of P-glycoprotein. Mol Pharmacol 61:964-73 (2002)  
Target
Name:
ATP-dependent translocase ABCB1
Synonyms:
ABCB1 MDR1_HUMAN Multidrug resistance protein 1 P-glycoprotein (P-gp) PGY1
Type:
Protein
Mol. Mass.:
141503.50
Organism:
Homo sapiens (Human)
Description:
P08183
Residue:
1280
  
Inhibitor
Name:
BDBM50017712
Synonyms:
(-)-reserpine 3,4,5-trimethoxybenzoyl methyl reserpate CHEMBL772 RESERPINE Serpalan methyl (3beta,16beta,17alpha,18beta,20alpha)-11,17-dimethoxy-18-[(3,4,5-trimethoxybenzoyl)oxy]yohimban-16-carboxylate
Type:
Small organic molecule
Emp. Form.:
C33H40N2O9
Mol. Mass.:
608.6787
SMILES:
CO[C@H]1[C@@H](C[C@@H]2CN3CCc4c([nH]c5cc(OC)ccc45)[C@H]3C[C@@H]2[C@@H]1C(=O)OC)OC(=O)c1cc(OC)c(OC)c(OC)c1
: