Target
Solute carrier family 22 member 6
Ligand
BDBM50206509
Substrate
Meas. Tech.
ChEMBL_839165 (CHEMBL2077836)
IC50
12300±n/a nM
Citation
 Khamdang, STakeda, MShimoda, MNoshiro, RNarikawa, SHuang, XLEnomoto, APiyachaturawat, PEndou, H Interactions of human- and rat-organic anion transporters with pravastatin and cimetidine. J Pharmacol Sci 94:197-202 (2004)  
Target
Name:
Solute carrier family 22 member 6
Synonyms:
OAT1 PAH transporter Renal organic anion transporter 1 SLC22A6 hPAHT | hROAT1
Type:
PROTEIN
Mol. Mass.:
61831.78
Organism:
Homo sapiens (Human)
Description:
ChEMBL_1487359
Residue:
563
  
Inhibitor
Name:
BDBM50206509
Synonyms:
4-Dipropylsulfamoyl-benzoic acid 4-Dipropylsulfamoyl-benzoic acid(probenecid) CHEMBL897 Probalan
Type:
Small organic molecule
Emp. Form.:
C13H19NO4S
Mol. Mass.:
285.359
SMILES:
CCCN(CCC)S(=O)(=O)c1ccc(cc1)C(O)=O
: