Target
Solute carrier family 22 member 7
Ligand
BDBM50206509
Substrate
Meas. Tech.
ChEMBL_836967 (CHEMBL2075807)
IC50
977000±n/a nM
Citation
 Khamdang, STakeda, MShimoda, MNoshiro, RNarikawa, SHuang, XLEnomoto, APiyachaturawat, PEndou, H Interactions of human- and rat-organic anion transporters with pravastatin and cimetidine. J Pharmacol Sci 94:197-202 (2004)  
Target
Name:
Solute carrier family 22 member 7
Synonyms:
Nlt Oat2 S22A7_RAT | Slc22a7
Type:
PROTEIN
Mol. Mass.:
58654.52
Organism:
Rattus norvegicus
Description:
ChEMBL_836967
Residue:
535
  
Inhibitor
Name:
BDBM50206509
Synonyms:
4-Dipropylsulfamoyl-benzoic acid 4-Dipropylsulfamoyl-benzoic acid(probenecid) CHEMBL897 Probalan
Type:
Small organic molecule
Emp. Form.:
C13H19NO4S
Mol. Mass.:
285.359
SMILES:
CCCN(CCC)S(=O)(=O)c1ccc(cc1)C(O)=O
: