Target
ATP-binding cassette sub-family C member 3
Ligand
BDBM50391003
Substrate
Meas. Tech.
ChEMBL_836618 (CHEMBL2077359)
Ki
77000±n/a nM
Citation
 Akita, HSuzuki, HHirohashi, TTakikawa, HSugiyama, Y Transport activity of human MRP3 expressed in Sf9 cells: comparative studies with rat MRP3. Pharm Res 19:34-41 (2002)  
Target
Name:
ATP-binding cassette sub-family C member 3
Synonyms:
ATP-binding cassette sub-family C member 3 Canalicular multispecific organic anion transporter 2 MLP-2 MRP3_RAT Mrp3 | Multidrug resistance-associated protein 3
Type:
PROTEIN
Mol. Mass.:
168984.11
Organism:
Rattus norvegicus
Description:
ChEMBL_839340
Residue:
1522
  
Inhibitor
Name:
BDBM50391003
Synonyms:
CHEMBL493586
Type:
Small organic molecule
Emp. Form.:
C16H16O10
Mol. Mass.:
368.2922
SMILES:
O[C@@H]1[C@@H](O)[C@H](OCc2cc(=O)oc3cc(O)ccc23)O[C@@H]([C@H]1O)C(O)=O
: