Target
Dual specificity tyrosine-phosphorylation-regulated kinase 1A
Ligand
BDBM50391191
Substrate
Meas. Tech.
ChEMBL_840812 (CHEMBL2090595)
IC50
>10000±n/a nM
Citation
 Bruel, ALogé, CTauzia, MLRavache, MLe Guevel, RGuillouzo, CLohier, JFOliveira Santos, JSLozach, OMeijer, LRuchaud, SBénédetti, HRobert, JM Synthesis and biological evaluation of new 5-benzylated 4-oxo-3,4-dihydro-5H-pyridazino[4,5-b]indoles as PI3Ka inhibitors. Eur J Med Chem 57:225-33 (2012)  
Target
Name:
Dual specificity tyrosine-phosphorylation-regulated kinase 1A
Synonyms:
DYR1A_RAT Dual-specificity tyrosine-(Y)-phosphorylation regulated kinase 1A Dyrk1a
Type:
Enzyme Catalytic Domain
Mol. Mass.:
85573.59
Organism:
RAT
Description:
Dual-specificity tyrosine-(Y)-phosphorylation regulated kinase 1A 0 RAT::Q63470
Residue:
763
  
Inhibitor
Name:
BDBM50391191
Synonyms:
CHEMBL2088669
Type:
Small organic molecule
Emp. Form.:
C19H13FN4O
Mol. Mass.:
332.3311
SMILES:
Cc1n[nH]c(=O)c2n(Cc3cccc(c3)C#N)c3ccc(F)cc3c12
: