Target
Indoleamine 2,3-dioxygenase 1
Ligand
BDBM50391359
Substrate
Meas. Tech.
ChEMBL_847930 (CHEMBL2150230)
IC50
22±n/a nM
Citation
 Röhrig, UFMajjigapu, SRGrosdidier, ABron, SStroobant, VPilotte, LColau, DVogel, PVan den Eynde, BJZoete, VMichielin, O Rational design of 4-aryl-1,2,3-triazoles for indoleamine 2,3-dioxygenase 1 inhibition. J Med Chem 55:5270-90 (2012)  
Target
Name:
Indoleamine 2,3-dioxygenase 1
Synonyms:
I23O1_MOUSE Ido Indo | Indoleamine-pyrrole 2,3-dioxygenase
Type:
PROTEIN
Mol. Mass.:
45639.39
Organism:
Mus musculus
Description:
ChEMBL_1452149
Residue:
407
  
Inhibitor
Name:
BDBM50391359
Synonyms:
CHEMBL2147998
Type:
Small organic molecule
Emp. Form.:
C8H7N3O
Mol. Mass.:
161.1607
SMILES:
Oc1ccccc1-c1c[nH]nn1
: