Target
Indoleamine 2,3-dioxygenase 1
Ligand
BDBM50355862
Substrate
Meas. Tech.
ChEMBL_847930 (CHEMBL2150230)
IC50
1500±n/a nM
Citation
 Röhrig, UFMajjigapu, SRGrosdidier, ABron, SStroobant, VPilotte, LColau, DVogel, PVan den Eynde, BJZoete, VMichielin, O Rational design of 4-aryl-1,2,3-triazoles for indoleamine 2,3-dioxygenase 1 inhibition. J Med Chem 55:5270-90 (2012)  
Target
Name:
Indoleamine 2,3-dioxygenase 1
Synonyms:
I23O1_MOUSE Ido Indo | Indoleamine-pyrrole 2,3-dioxygenase
Type:
PROTEIN
Mol. Mass.:
45639.39
Organism:
Mus musculus
Description:
ChEMBL_1452149
Residue:
407
  
Inhibitor
Name:
BDBM50355862
Synonyms:
CHEMBL1909734
Type:
Small organic molecule
Emp. Form.:
C8H6ClN3
Mol. Mass.:
179.606
SMILES:
Clc1ccccc1-c1c[nH]nn1
: