Target
Tryptophan 2,3-dioxygenase
Ligand
BDBM50391362
Substrate
Meas. Tech.
ChEMBL_847932 (CHEMBL2150232)
IC50
>100000±n/a nM
Citation
 Röhrig, UFMajjigapu, SRGrosdidier, ABron, SStroobant, VPilotte, LColau, DVogel, PVan den Eynde, BJZoete, VMichielin, O Rational design of 4-aryl-1,2,3-triazoles for indoleamine 2,3-dioxygenase 1 inhibition. J Med Chem 55:5270-90 (2012)  
Target
Name:
Tryptophan 2,3-dioxygenase
Synonyms:
T23O_MOUSE TRPO Tdo2 Tryptophan oxygenase Tryptophanase
Type:
PROTEIN
Mol. Mass.:
47757.90
Organism:
Mus musculus
Description:
ChEMBL_1452150
Residue:
406
  
Inhibitor
Name:
BDBM50391362
Synonyms:
CHEMBL2148000
Type:
Small organic molecule
Emp. Form.:
C8H6FN3
Mol. Mass.:
163.1517
SMILES:
Fc1ccccc1-c1c[nH]nn1
: