Target
D(3) dopamine receptor
Ligand
BDBM50391425
Substrate
Meas. Tech.
ChEMBL_848925 (CHEMBL2149719)
Ki
0.38±n/a nM
Citation
 Chen, JLevant, BWang, S High-affinity and selective dopamine D3 receptor full agonists. Bioorg Med Chem Lett 22:5612-7 (2012)  
Target
Name:
D(3) dopamine receptor
Synonyms:
DOPAMINE D3 Dopamine D3 receptor | Drd3
Type:
Protein
Mol. Mass.:
49540.58
Organism:
Rattus norvegicus (Rat)
Description:
P19020
Residue:
446
  
Inhibitor
Name:
BDBM50391425
Synonyms:
CHEMBL2146499
Type:
Small organic molecule
Emp. Form.:
C23H34ClN5O2S2
Mol. Mass.:
512.131
SMILES:
CCCN(CC[C@H]1CC[C@@H](CC1)NS(=O)(=O)c1cccnc1Cl)[C@H]1CCc2nc(N)sc2C1
: