Target
Replicase polyprotein 1a
Ligand
BDBM50391431
Substrate
Meas. Tech.
ChEMBL_848932 (CHEMBL2149726)
IC50
9200±n/a nM
Citation
 Park, JYKim, JHKim, YMJeong, HJKim, DWPark, KHKwon, HJPark, SJLee, WSRyu, YB Tanshinones as selective and slow-binding inhibitors for SARS-CoV cysteine proteases. Bioorg Med Chem 20:5928-35 (2012)  
Target
Name:
Replicase polyprotein 1a
Synonyms:
3C-like proteinase 3CLp Growth factor-like peptide Non-structural protein 1 Non-structural protein 11 Non-structural protein 3 Non-structural protein 6 Non-structural protein 8 ORF1a polyprotein PL2-PRO Papain-like proteinase Replicase polyprotein 1a SARS coronavirus 3C-like proteinase nsp1 nsp11 nsp3 nsp5 nsp7 nsp9 pp1a
Type:
Enzyme
Mol. Mass.:
486353.36
Organism:
Human SARS coronavirus (SARS-CoV)
Description:
P0C6U8
Residue:
4382
  
Inhibitor
Name:
BDBM50391431
Synonyms:
CHEMBL2146517 | acs.jmedchem.1c00409_ST.502
Type:
Small organic molecule
Emp. Form.:
C20H18O5
Mol. Mass.:
338.3539
SMILES:
COC(=O)[C@@]1(C)CCCc2c1ccc1-c3occ(C)c3C(=O)C(=O)c21
: