Target
Replicase polyprotein 1a
Ligand
BDBM50009219
Substrate
Meas. Tech.
ChEMBL_848933 (CHEMBL2149727)
IC50
21100±n/a nM
Citation
 Park, JYKim, JHKim, YMJeong, HJKim, DWPark, KHKwon, HJPark, SJLee, WSRyu, YB Tanshinones as selective and slow-binding inhibitors for SARS-CoV cysteine proteases. Bioorg Med Chem 20:5928-35 (2012)  
Target
Name:
Replicase polyprotein 1a
Synonyms:
3C-like proteinase 3CLp Growth factor-like peptide Non-structural protein 1 Non-structural protein 11 Non-structural protein 3 Non-structural protein 6 Non-structural protein 8 ORF1a polyprotein PL2-PRO Papain-like proteinase Replicase polyprotein 1a SARS coronavirus 3C-like proteinase nsp1 nsp11 nsp3 nsp5 nsp7 nsp9 pp1a
Type:
Enzyme
Mol. Mass.:
486353.36
Organism:
Human SARS coronavirus (SARS-CoV)
Description:
P0C6U8
Residue:
4382
  
Inhibitor
Name:
BDBM50009219
Synonyms:
2-isopropyl-8,8-dimethyl-5,6,7,8-tetrahydrophenanthrene-3,4-dione MILTIRONE miltirone;2-Isopropyl-8,8-dimethyl-5,6,7,8-tetrahydro-phenanthrene-3,4-dione
Type:
Small organic molecule
Emp. Form.:
C19H22O2
Mol. Mass.:
282.3768
SMILES:
CC(C)C1=Cc2ccc3c(CCCC3(C)C)c2C(=O)C1=O
: