Target
Delta-type opioid receptor
Ligand
BDBM50329095
Substrate
Meas. Tech.
ChEMBL_850392 (CHEMBL2150812)
Ki
0.16±n/a nM
Citation
 Ida, YMatsubara, ANemoto, TSaito, MHirayama, SFujii, HNagase, H Synthesis of quinolinomorphinan derivatives as highly selectived opioid receptor ligands. Bioorg Med Chem 20:5810-31 (2012)  
Target
Name:
Delta-type opioid receptor
Synonyms:
DOR-1 MSL-2 OPRD_MOUSE Oprd1
Type:
Enzyme Catalytic Domain
Mol. Mass.:
40577.25
Organism:
MOUSE
Description:
P32300
Residue:
372
  
Inhibitor
Name:
BDBM50329095
Synonyms:
CHEMBL1270282
Type:
Small organic molecule
Emp. Form.:
C24H24N2O2
Mol. Mass.:
372.4596
SMILES:
CN1CC[C@]23Cc4nc5ccccc5cc4C[C@@]2(O)[C@H]1Cc1ccc(O)cc31
: