Target
Histamine H1 receptor
Ligand
BDBM50391698
Substrate
Meas. Tech.
ChEMBL_848010 (CHEMBL2150561)
Ki
0.251±n/a nM
Citation
 Procopiou, PABrowning, CGore, PMLynn, SMRichards, SASlack, RJSollis, SL Synthesis and pharmacological investigation of azaphthalazinone human histamine H(1) receptor antagonists. Bioorg Med Chem 20:6097-108 (2012)  
Target
Name:
Histamine H1 receptor
Synonyms:
H1R HISTAMINE H1 HRH1_HUMAN
Type:
G Protein-Coupled Receptor (GPCR)
Mol. Mass.:
55808.72
Organism:
Homo sapiens (Human)
Description:
Cell pellets from SK-N-MC cells transfected with human H1 receptor were used in binding assay.
Residue:
487
  
Inhibitor
Name:
BDBM50391698
Synonyms:
CHEMBL2146801
Type:
Small organic molecule
Emp. Form.:
C22H25ClN4O2
Mol. Mass.:
412.913
SMILES:
COCCN1CCC[C@@H]1Cn1nc(Cc2ccc(Cl)cc2)c2cnccc2c1=O
: