Target
Alpha-1B adrenergic receptor
Ligand
BDBM50391710
Substrate
Meas. Tech.
ChEMBL_848015 (CHEMBL2150566)
Ki
12.59±n/a nM
Citation
 Procopiou, PABrowning, CGore, PMLynn, SMRichards, SASlack, RJSollis, SL Synthesis and pharmacological investigation of azaphthalazinone human histamine H(1) receptor antagonists. Bioorg Med Chem 20:6097-108 (2012)  
Target
Name:
Alpha-1B adrenergic receptor
Synonyms:
ADA1B_HUMAN Adrenergic alpha1B Adrenergic receptor alpha Alpha 1B-adrenoreceptor | Alpha-1B adrenergic receptor
Type:
Enzyme
Mol. Mass.:
56862.13
Organism:
Homo sapiens (Human)
Description:
P35368
Residue:
520
  
Inhibitor
Name:
BDBM50391710
Synonyms:
CHEMBL2146803
Type:
Small organic molecule
Emp. Form.:
C23H26ClN3O2
Mol. Mass.:
411.924
SMILES:
COCCN1CCC[C@@H]1Cn1nc(Cc2ccc(Cl)cc2)c2ccccc2c1=O
: