Target
Alpha-1A adrenergic receptor
Ligand
BDBM50391696
Substrate
Meas. Tech.
ChEMBL_848012 (CHEMBL2150563)
Ki
31.62±n/a nM
Citation
 Procopiou, PABrowning, CGore, PMLynn, SMRichards, SASlack, RJSollis, SL Synthesis and pharmacological investigation of azaphthalazinone human histamine H(1) receptor antagonists. Bioorg Med Chem 20:6097-108 (2012)  
Target
Name:
Alpha-1A adrenergic receptor
Synonyms:
ADA1A_HUMAN ADRA1C Alpha 1A-adrenoceptor Alpha adrenergic receptor 1a Alpha-adrenergic receptor 1c adrenergic Alpha1 | adrenergic Alpha1C
Type:
Cell-surface receptors
Mol. Mass.:
51511.67
Organism:
Homo sapiens (Human)
Description:
P35348
Residue:
466
  
Inhibitor
Name:
BDBM50391696
Synonyms:
CHEMBL2146813
Type:
Small organic molecule
Emp. Form.:
C38H48ClN5O2
Mol. Mass.:
642.273
SMILES:
Clc1ccc(Cc2nn(C[C@H]3CCCN3CCCCc3ccc(OCCCN4CCCCCC4)cc3)c(=O)c3ccncc23)cc1
: