Target
Alpha-1A adrenergic receptor
Ligand
BDBM50391708
Substrate
Meas. Tech.
ChEMBL_848012 (CHEMBL2150563)
Ki
31.62±n/a nM
Citation
 Procopiou, PABrowning, CGore, PMLynn, SMRichards, SASlack, RJSollis, SL Synthesis and pharmacological investigation of azaphthalazinone human histamine H(1) receptor antagonists. Bioorg Med Chem 20:6097-108 (2012)  
Target
Name:
Alpha-1A adrenergic receptor
Synonyms:
ADA1A_HUMAN ADRA1C Alpha 1A-adrenoceptor Alpha adrenergic receptor 1a Alpha-adrenergic receptor 1c adrenergic Alpha1 | adrenergic Alpha1C
Type:
Cell-surface receptors
Mol. Mass.:
51511.67
Organism:
Homo sapiens (Human)
Description:
P35348
Residue:
466
  
Inhibitor
Name:
BDBM50391708
Synonyms:
CHEMBL1767136
Type:
Small organic molecule
Emp. Form.:
C21H22ClN3O
Mol. Mass.:
367.872
SMILES:
CN1CCC[C@@H]1Cn1nc(Cc2ccc(Cl)cc2)c2ccccc2c1=O
: