Target
Histamine H1 receptor
Ligand
BDBM50391696
Substrate
Meas. Tech.
ChEMBL_848010 (CHEMBL2150561)
Ki
17.38±n/a nM
Citation
 Procopiou, PABrowning, CGore, PMLynn, SMRichards, SASlack, RJSollis, SL Synthesis and pharmacological investigation of azaphthalazinone human histamine H(1) receptor antagonists. Bioorg Med Chem 20:6097-108 (2012)  
Target
Name:
Histamine H1 receptor
Synonyms:
H1R HISTAMINE H1 HRH1_HUMAN
Type:
G Protein-Coupled Receptor (GPCR)
Mol. Mass.:
55808.72
Organism:
Homo sapiens (Human)
Description:
Cell pellets from SK-N-MC cells transfected with human H1 receptor were used in binding assay.
Residue:
487
  
Inhibitor
Name:
BDBM50391696
Synonyms:
CHEMBL2146813
Type:
Small organic molecule
Emp. Form.:
C38H48ClN5O2
Mol. Mass.:
642.273
SMILES:
Clc1ccc(Cc2nn(C[C@H]3CCCN3CCCCc3ccc(OCCCN4CCCCCC4)cc3)c(=O)c3ccncc23)cc1
: