Target
Dual specificity mitogen-activated protein kinase kinase 1
Ligand
BDBM50391802
Substrate
Meas. Tech.
ChEMBL_850079 (CHEMBL2149502)
IC50
0.9±n/a nM
Citation
 Rice, KDAay, NAnand, NKBlazey, CMBowles, OJBussenius, JCostanzo, SCurtis, JKDefina, SCDubenko, LEngst, SJoshi, AAKennedy, ARKim, AIKoltun, ESLougheed, JCManalo, JCMartini, JFNuss, JMPeto, CJTsang, THYu, PJohnston, S Novel Carboxamide-Based Allosteric MEK Inhibitors: Discovery and Optimization Efforts toward XL518 (GDC-0973). ACS Med Chem Lett 3:416-421 (2012)  
Target
Name:
Dual specificity mitogen-activated protein kinase kinase 1
Synonyms:
Dual specificity mitogen-activated protein kinase (MEK) Dual specificity mitogen-activated protein kinase kinase 1 (MEK1) Dual specificity mitogen-activated protein kinase kinase MEK1/2 MAP kinase kinase 1 MAPK/ERK kinase 1 MEK-1 MP2K1_HUMAN PRKMK1 | VHL-MAP2K1/MAP2K2
Type:
Other Protein Type
Mol. Mass.:
43439.03
Organism:
Homo sapiens (Human)
Description:
Full-length human MEK-1 was generated by PCR and purified as a fusion protein from Escherichia coli lysates.
Residue:
393
  
Inhibitor
Name:
BDBM50391802
Synonyms:
(3,4-difluoro-2-(2-fluoro-4-iodophenylamino)phenyl)(3-hydroxy-3-(piperidin-2-yl)azetidin-1-yl)methanone COBIMETINIB FUMARATE GDC-0973 cobimetinib
Type:
Small organic molecule
Emp. Form.:
C21H21F3IN3O2
Mol. Mass.:
531.31
SMILES:
OC1(CN(C1)C(=O)c1ccc(F)c(F)c1Nc1ccc(I)cc1F)[C@@H]1CCCCN1
: